花费 1779ms 找到386081条记录
1 pyvenv-3.4 returned non-zero exit status 1
2014年06月09 - ', 'ensurepip', '--upgrade', '--default-pip']' returned non-zero exit status 1 错误:命令'['/home/fmr/projects/ave/venv/bin/python3.4', '-Im' ' ', ' ', ' ', ' ', ' ', ' ', ' ', ' ', ' ', ' ', ' ', ' ', ' ', ' ', ' ', ' ', ' ', ' ', ' ', ' ', ' ', ' ', ' ', ' ', ' ', ' ', ' ', ' ', ' ', ' ', ' ', ' ', ' ', '
2 Non Zero Exit Status” R 3.0.1 'XML' and 'RCurl'
2014年12月08 - : installation of package ‘RCurl’ had non-zero exit status The downloaded source packages are in ‘/tmp/RtmpUwBkbS/downloaded_packages’ > install.packages("XML
3 vagrant启动报错The following SSH command responded with a non-zero exit status.
2015年03月07 - following SSH command responded with a non-zero exit status.Vagrant assumes that this means the command failed!ARPCHECK=no /sbin/ifup eth1 2> /dev
4 collect2: error: ld returned 1 exit status
2015年03月25 - 在mac 上编译 build_native.py 报错:collect2: error: ld returned 1 exit status “out/target/product/xxxx/obj/lib/xxxxxx.so: undefined reference
5 collect2: ld returned 1 exit status
2009年06月16 - make install时出现: undefined reference to 'some functions' collect2: ld returned 1 exit status 我的原因是makefile中没有加足那些undefined referenced
6 collect2: ld returned 1 exit status
2014年05月07 - for CUdxClient:UdxClient.cpp(.data.rel.ro+0x0): error: undefined reference to 'vtable for __cxxabiv1::__si_class_type_info' collect2: ld returned 1 exit status
7 Old Fortran Program: ld returned 1 exit status
2013年08月09 - /i686-linux-gnu/4.7/../../../i386-linux-gnu/crt1.o: In function `_start': (.text+0x18): undefined reference to `main' collect2: error: ld returned 1 exit status
8 解决android studio中3个错误non-zero exit value 1; non-zero exit value 2; non-zero exit value 3
2016年10月27 - : Process 'command 'F:\Program Files (x86)\Java\jdk1.8.0_31\bin\java.exe'' finished with non-zero exit value 1这个是因为依赖包重复了 ,如图。app中实现了对easeUI的依赖,但是app和easeUI
9 finished with non-zero exit value 1
2016年07月22 - /Documents/pandans/android-sdk-macosx/build-tools/23.0.2/aapt'' finished with non-zero exit value 1 查询判断: ./gradlew build --info --stacktrace --debug
10 collect2 ld returned 1 exit status
2010年04月19 - , argv); StandardDialogs s; return app.exec(); } Build Issus: collect2 ld returned 1 exit status Complie Output: Running build steps

 
© 2014-2018 ITdaan.com 粤ICP备14056181号