花费 890ms 找到2351435条记录
1 crt1.o no such file c++ compilation error on linux x64
2012年05月28 - /GNU-Linux-x86 g++ -m32 -o dist/Debug/GNU-Linux-x86/goatscheese build/Debug/GNU-Linux-x86/main.o /usr/bin/ld: crt1.o: No such file: No such file or directory
2 64Linux编译C代码,crt1.o文件格式不对的问题
2016年03月16 - 今天在某台64LInux下编译一个简单的hello world的C程序,报错: /usr/lib/gcc/x86_64-redhat-linux/4.4.7/../../../crt1.o: could not read symbols: File in wrong format
3 /usr/lib/gcc/x86_64-linux-gnu/4.4.5/../../../../lib/crt1.o: In function `_start'问题解决
2011年04月19 - hello.c 就会出现/usr/lib/gcc/x86_64-linux-gnu/4.4.5/../../../../lib/crt1.o: In function `_start' : (.text+0x20): undefined reference to `main' collect2
4 Debugging the error “gcc: error: x86_64-linux-gnu-gcc: No such file or directory”
2014年03月22 - libstructcompare_a-structcompare.o `test -f 'structcompare.c' || echo './'`structcompare.c gcc: error: x86_64-linux-gnu-gcc: No such file or directory x86_64-linux
5 Swift: Apple Mach-O Linker Error (file too small for architecture x86_64)
2015年05月28 - /Objects-normal/x86_64/ViewController.o' for architecture x86_64 clang: error: linker command failed with exit code 1 (use -v to see invocation) I've checked
6 Undefined symbols for architecture x86_64: C++ compilation
2013年10月17 - : Bretts-MacBook-Pro:HW4 make g++ main.o Arraylist.o Myexception.cpp RatInMaze.cpp -o main Undefined symbols for architecture x86_64: "RatInMaze::searchQueue(int, int
7 Compilation Error of C code on Linux (Same code compiles on OSX)
2012年08月25 - ] In file included from errorLogger.h:24:0, from database.h:16, from database.c:9: signalHandling.h:24:18: error: unknown
8 linux下安装出现/usr/bin/ld: crt1.o: No such file: No such file or directory
2014年09月28 - 之后configure报错 ./configure checking build system type... x86_64-unknown-linux-gnu checking host system type... x86_64-unknown-linux
9 luci compilation error:iwinfo.h: No such file or directory
2014年11月03 - error: iwinfo.h: No such file or directory #include <iwinfo.h> ^ compilation terminated. make[1]: *** [src/luci-bwc.o] Error 1 make
10 fatal error: string: No such file or directory compilation terminated
2012年02月03 - , wherever I used string.h. But even though I am getting the fatal error: string: No such file or directory compilation terminated. when I run as 我使用了名称空间std

 
© 2014-2018 ITdaan.com 粤ICP备14056181号