花费 460ms 找到1559032条记录
1 class Qlabel has no member named 'ans'
2014年12月12 - to this so I am still trying to figure out what is happening. The error gives me "class Qlabel has no member named 'ans'" when I try to use the line ui->
2 C++ class has no member named
2013年07月05 - Attack' has no member named 'printShiz'
3 错误:'class QApplication' has no member named 'setMainwidget'
2013年03月07 - 在学习 QT的过程中 遇到了一个问题 错误如下: 'class QApplication' has no member named 'setMainWidget' 在 类QApplication里面 没有找到 setMainWidget 成员
4 'class QWidget' has no member named 'setFrameStyle'
2013年10月04 - compiling it in Qt Creator, it gives the error: 我正在尝试编译一个程序(在这里找到:http://sourceforge.net/projects/lisem/),根据作者的说明。但是,当在Qt创建者中编译时,它会给出错误: class QWidget has
5 error: ‘class QApplication’ has no member named ‘setMainWidget’
2012年04月26 - no member named ‘setMainWidget’ make: *** [HelloWorld.o] Error 1 郁闷呀, 前面2步没问题, 又出问题了, 不过, 不要慌, 看看错误提示先: HelloWorld.cpp:9: error: ‘class QApplication’ has
6 C++: error: ‘classhas no member named
2013年06月01 - 以下错误: burgers1d.cpp:268:12: error: ‘class ValSrc’ has no member named ‘calcFourierCoefficient’ This makes sense, since the variable is defined
7 Qt error: 'const class QString' has no member named 'toStdString'
2013年04月04 - I am getting this error error: 'const class QString' has no member named 'toStdString' though QString has it. (link). 我得到了这个错误错误:“const类QString”没有名
8 c++ compiler error class has no member named
2010年12月06 - I send in an Edge and try to change the target through the Edge but am having a compiler error of class Edge has no member named target. 在我的Edge类中,有一个
9 QT编译提示error: 'class QTextBrowser' has no member named 'setStyleSheet'
2015年08月19 - 我在嵌入式环境下,使用QT作为GUI的工具。 用QT4.7.0的QT工程做好的一套画面,但是,在目标Linux编译服务器上,进行交叉编译时提示下面错误: error: 'class QTextBrowser' has no member named 'setStyleSheet' 请问
10 'struct ' has no member named
2014年10月30 - :6: error: 'struct <anonymous>' has no member named 'front' new->front = NULL; ^ queueADT.c:37:6: error: 'struct <anonymous>' has

 
© 2014-2018 ITdaan.com 粤ICP备14056181号