花费 271ms 找到444598条记录
1 javac: file not found: first.java Usage: javac
2013年12月14 - 6” The Environmental settings are as follows 环境设置如下 CLASSPATH C:\Program Files\Java\jre8\bin Variable name: LEJOS_NXT_JAVA_HOME Variable value: C:\Program Files (x86
2 Failed executing 'cmd.exe /X /C ""C:\Program Files\Java\jdk1.6.0_38\jre\..\bin\jarsigner.exe"
2015年06月05 - patientclient_1.30_1: Failed executing 'cmd.exe /X /C ""C:\Program Files\Java\jdk1.6.0_38\jre\..\bin\jarsigner.exe" -sigalg MD5withRSA -digestalg SHA1 -keystore F
3 Failed to load the JNI shared library “C:\Program Files\Java\jdk1.7.0_40\bin\..\jre\bin\server\jvm.dll”
2014年02月27 - to load the JNI shared library "C:\Program Files\Java\jdk1.7.0_40\bin..\jre\bin\server\jvm.dll" 错误:未能加载JNI共享库“C:\程序文件\Java\jdk1.7.0_40\bin. \jre\bin\服务器
4 maven报错:Unable to locate the Javac Compiler in: D:\Program Files\Java\jre7\..\lib\tools.jar
2017年05月16 - 现象:maven项目之间mvn install报如下错误: Unable to locate the Javac Compiler in: D:\Program Files\Java\jre7\..\lib\tools.jar [ERROR] Unable to locate
5 eclipse环境 Cannot run program "C:\Java\jdk1.6.0_02\bin\javaw.exe" (in directory "D:\project\SDK"): Cr
2015年07月22 - 转自VC错误:http://www.vcerror.com/?p=1845 问题描述: 在eclipse中,执行main方法函数。 错误提示: Exception occurred executing command line. Cannot run program "C:\Java
6 Eclipse通过Maven构建时出现: Fatal error compiling: tools.jar not found: Fatal error compiling: tools.jar not found: C:\Program Files\Java\jre1.8.0_31\..\lib
2017年05月27 - error compiling: tools.jar not found: C:\Program Files\Java\jre1.8.0_31\..\lib\tools.jar 这种错误是偶然性的,构建几次可能出现一次,也有可能经常出现。 解决方法: 把jre换成jdk的目录,以前是:C
7 link.exe returns error LNK1181: cannot open input file 'C:\Program.obj'
2015年06月18 - I'm compiling with a Batch file containing 我正在编译一个包含批处理文件的文件 @echo off set link=C:\Program Files (x86)\Microsoft Visual Studio 11.0\VC\bin\link
8 Error: The imported project “C:\Program Files (x86)\MSBuild\Microsoft.Cpp\v4.0\V110\Microsoft.Cpp.Default.props” was not found
2014年03月06 - " was not found. Confirm that the path in the declaration is correct, and that the file exists on disk. 导入的项目“C:\程序文件(x86)\MSBuild\Microsoft.Cpp\v4.0\ v4.0\V110
9 java.io.IOException: Cannot run programC:\AutoIt\ModenaAutoIt.exe”: java.io.IOException: error=2, No such file or directory
2014年02月18 - run program "C:\AutoIt\ModenaAutoIt.exe": java.io.IOException: error=2, No such file or directory" . io .IOException:不能运行程序“C:\AutoIt\ModenaAutoIt”。exe
10 git command for Program FIles (x86)
2013年12月11 - $ ./git-credential-winstore -i C:\Program Files (x86)\Git\bin\ sh.exe": syntax error near unexpected token `(' Can anyone tell me how to write the path for this? 有人能告诉我怎么写这条

 
© 2014-2018 ITdaan.com 粤ICP备14056181号