花费 165ms 找到443060条记录
安装GD-2.0.9完美解决make error
2009年08月13 - 安装gd . . nbsp nbsp . configure prefix usr local gd with zlib with jpeg usr local jpeg with libiconv
安装php时,make步骤报错make: *** [ext/gd/gd.lo] Error 1
2015年08月26 - 安装PHP时,make步骤报错make: ext gd gd.lo Error usr local src LAMP memcahed catci php . . ext gd gd ctx.c
php5.3.*编译出现make: *** [ext/gd/libgd/gd_compat.lo] Error 1 解决方法
2013年08月22 - . . ext gd libgd gd compat.c: : usr local jpeg include jpeglib.h: : error: expected declaration specif
php5.3.*编译出现make: *** [ext/gd/libgd/gd_compat.lo] Error 1的解决方法
2015年07月24 - 转自VC错误:http: www.vcerror.com p 问题描述: 升级系统,把php . . 升级到 . . ,按照以前的编译参数,configure能正常通过,但是在make的时候提示
make: *** [ext/gd/libgd/gd_compat.lo] Error 1
2016年02月26 - . . ext gd libgd gd compat.c: : usr local jpeg include jpeglib.h: : error: expected declaration specifiers
configure error:安装php时出现configure: error: Unable to find gd.h anywhere under,错误解决
2014年06月28 - 在进行PHP开发环境源码安装时,在安装PHP . . 是出现:configure: error: Unable to find gd.h anywhere under错误 解决方式: .在gd
make: *** [ext/gd/gd.lo] 错误 1’
2016年02月26 - 参考: 转 安装php时报gd相关的错误gd ctx.c 年 月 日woyoo没有评论 转自:http: blog.csdn.net hzcyclone article details 在安装php
完美解决关于php gd生成中文字符乱码的问题
2013年04月19 - font file font simhei.ttf header Content type: image png im imagecreate , bg imagecolorallocate im,
linux重新编译安装gd,增加freetype支持,解决验证码不显示问题,Fatal error: Call to undefined function imagettftext()
2015年08月14 - Think Verify.class.php on line 查看phpinfo 后得知,gd中没有freetype的支持 解决: 首先安装freestyle,php gd 确保先安装freestyle
完美解决 DXUT 之 error LNK2019
2014年02月21 - 今天在用dxut的时候出现一个奇怪的问题,设置都搞了但是还是报错 gt dxut.lib DXUT.obj : error LNK : 无法解析的外部符号 imp

智能推荐
 
© 2014-2019 ITdaan.com 粤ICP备14056181号  

赞助商广告